Reaction Details
TargetBeta-galactosidase
LigandBDBM50261419
Substrate/Competitorn/a
Meas. Tech.ChEMBL_1696006 (CHEMBL4046896)
Ki 0.110000±n/a nM
Citation Pickens, JBWang, FStriegler, S Picomolar inhibition of?-galactosidase (bovine liver) attributed to loop closure. Bioorg Med Chem25:5194-5202 (2017) 
 
Beta-galactosidase
Name:Beta-galactosidase
Type:Protein
Mol. Mass.:73420.88
Organism:Bos taurus (Bovine)
Description:n/a
Residue:653
BDBM50261419
NameBDBM50261419
Synonyms:CHEMBL3359674
TypeSmall organic molecule
Emp. Form.C13H26N2O4
Mol. Mass.274.3565
SMILESCCCCCCC\N=C1/N[C@H](CO)[C@H](O)[C@H](O)[C@H]1O