Reaction Details
TargetBeta-galactosidase
LigandBDBM50261443
Substrate/Competitorn/a
Meas. Tech.ChEMBL_1696006 (CHEMBL4046896)
Ki 0.230000±n/a nM
Citation Pickens, JBWang, FStriegler, S Picomolar inhibition of?-galactosidase (bovine liver) attributed to loop closure. Bioorg Med Chem25:5194-5202 (2017) 
 
Beta-galactosidase
Name:Beta-galactosidase
Type:Protein
Mol. Mass.:73420.88
Organism:Bos taurus (Bovine)
Description:n/a
Residue:653
BDBM50261443
NameBDBM50261443
Synonyms:CHEMBL3359667
TypeSmall organic molecule
Emp. Form.C13H17FN2O4
Mol. Mass.284.2835
SMILESOC[C@H]1N\C(=N/Cc2ccccc2F)[C@H](O)[C@@H](O)[C@H]1O