Reaction Details
TargetBeta-galactosidase
LigandBDBM50261439
Substrate/Competitorn/a
Meas. Tech.ChEMBL_1696005 (CHEMBL4046895)
IC50 22±n/a nM
Citation Pickens, JBWang, FStriegler, S Picomolar inhibition of?-galactosidase (bovine liver) attributed to loop closure. Bioorg Med Chem25:5194-5202 (2017) 
 
Beta-galactosidase
Name:Beta-galactosidase
Type:Protein
Mol. Mass.:73420.88
Organism:Bos taurus (Bovine)
Description:n/a
Residue:653
BDBM50261439
NameBDBM50261439
Synonyms:CHEMBL3815031
TypeSmall organic molecule
Emp. Form.C14H28N2O4
Mol. Mass.288.3831
SMILESCCCCC(CC)CNC1=N[C@H](CO)[C@H](O)[C@H](O)[C@H]1O