Reaction Details
TargetBeta-galactosidase
LigandBDBM50140060
Substrate/Competitorn/a
Meas. Tech.ChEMBL_1696006 (CHEMBL4046896)
Ki 1500±n/a nM
Citation Pickens, JBWang, FStriegler, S Picomolar inhibition of?-galactosidase (bovine liver) attributed to loop closure. Bioorg Med Chem25:5194-5202 (2017) 
 
Beta-galactosidase
Name:Beta-galactosidase
Type:Protein
Mol. Mass.:73420.88
Organism:Bos taurus (Bovine)
Description:n/a
Residue:653
BDBM50140060
NameBDBM50140060
Synonyms:CHEMBL3754250
TypeSmall organic molecule
Emp. Form.C15H22N2O4
Mol. Mass.294.3462
SMILESCO[C@@H]1[C@@H](O)[C@@H](O)[C@@H](CO)N=C1NCc1ccc(C)cc1