Reaction Details
TargetD(2) dopamine receptor
LigandBDBM50261539
Substrate/Competitorn/a
Meas. Tech.ChEBML_1696093
Ki 1.3±n/a nM
Citation Männel, BHübner, HMöller, DGmeiner, P ?-Arrestin biased dopamine D2 receptor partial agonists: Synthesis and pharmacological evaluation. Bioorg Med Chem25:5613-5628 (2017) 
 
D(2) dopamine receptor
Name:D(2) dopamine receptor
Type:Cell-surface receptors
Mol. Mass.:50647.10
Organism:Homo sapiens (Human)
Description:P14416
Residue:443
BDBM50261539
NameBDBM50261539
Synonyms:CHEMBL4068561
TypeSmall organic molecule
Emp. Form.C25H28N6O4
Mol. Mass.476.5276
SMILESO\N=C\c1cnn2ccc(OCCCCN3CCN(CC3)c3ccc(O)c4[nH]c(=O)ccc34)cc12