Reaction Details
TargetDelta-type opioid receptor
LigandBDBM50010532
Substrate/Competitorn/a
Meas. Tech.ChEBML_147016
Ki 1.6±n/a nM
Citation Yoshino, HNakazawa, TArakawa, YKaneko, TTsuchiya, YMatsunaga, MAraki, SIkeda, MYamatsu, KTachibana, S Synthesis and structure-activity relationships of dynorphin A-(1-8) amide analogues. J Med Chem33:206-12 (1990) Delta-type opioid receptor
Name:Delta-type opioid receptor
Type:G Protein-Coupled Receptor (GPCR)
Mol. Mass.:40382.98
Organism:Homo sapiens (Human)
Description:Competition binding assays were carried out using membrane preparations from transfected HN9.10 cells that constitutively expressed the delta opioid receptor.
Residue:372
BDBM50010532
NameBDBM50010532
Synonyms:13-[2-Amino-3-(4-hydroxy-phenyl)-propionylamino]-7-benzyl-6,9,12-trioxo-1,2-dithia-5,8,11-triaza-cyclotetradecane-4-carboxylic acid (1-{[1-(1-ethylcarbamoyl-3-methyl-butylcarbamoyl)-4-guanidino-butyl]-methyl-carbamoyl}-4-guanidino-butyl)-amide | CHEMBL441939
TypeSmall organic molecule
Emp. Form.C47H73N15O9S2
Mol. Mass.1056.308
SMILESCCNC(=O)[C@H](CC(C)C)NC(=O)[C@H](CCCNC(N)=N)N(C)C(=O)[C@H](CCCNC(N)=N)NC(=O)[C@H]1CSSC[C@H](NC(=O)[C@@H](N)Cc2ccc(O)cc2)C(=O)NCC(=O)N[C@H](Cc2ccccc2)C(=O)N1