Reaction Details
TargetMu-type opioid receptor
LigandBDBM50010548
Substrate/Competitorn/a
Meas. Tech.ChEBML_146989
IC50 6.6±n/a nM
Citation Yoshino, HNakazawa, TArakawa, YKaneko, TTsuchiya, YMatsunaga, MAraki, SIkeda, MYamatsu, KTachibana, S Synthesis and structure-activity relationships of dynorphin A-(1-8) amide analogues. J Med Chem33:206-12 (1990) Mu-type opioid receptor
Name:Mu-type opioid receptor
Type:Enzyme Catalytic Domain
Mol. Mass.:11165.58
Organism:GUINEA PIG
Description:P97266
Residue:98
BDBM50010548
NameBDBM50010548
Synonyms:2-[2-(2-{2-[3-(4-Hydroxy-phenyl)-2-methylamino-propionylamino]-acetylamino}-acetylamino)-3-phenyl-propionylamino]-4-methyl-pentanoic acid {4-guanidino-1-[4-guanidino-1-(1-hexylcarbamoyl-3-methyl-butylcarbamoyl)-butylcarbamoyl]-butyl}-amide | CHEMBL412769
TypeSmall organic molecule
Emp. Form.C53H87N15O9
Mol. Mass.1078.353
SMILESCCCCCCNC(=O)[C@H](CC(C)C)NC(=O)[C@H](CCCNC(N)=N)NC(=O)[C@H](CCCNC(N)=N)NC(=O)[C@H](CC(C)C)NC(=O)[C@@H](Cc1ccccc1)NC(=O)CNC(=O)CNC(=O)[C@H](Cc1ccc(O)cc1)NC