Reaction Details
TargetMu-type opioid receptor
LigandBDBM50010544
Substrate/Competitorn/a
Meas. Tech.ChEBML_146989
IC50 27±n/a nM
Citation Yoshino, HNakazawa, TArakawa, YKaneko, TTsuchiya, YMatsunaga, MAraki, SIkeda, MYamatsu, KTachibana, S Synthesis and structure-activity relationships of dynorphin A-(1-8) amide analogues. J Med Chem33:206-12 (1990) Mu-type opioid receptor
Name:Mu-type opioid receptor
Type:Enzyme Catalytic Domain
Mol. Mass.:11165.58
Organism:GUINEA PIG
Description:P97266
Residue:98
BDBM50010544
NameBDBM50010544
Synonyms:2-{5-Guanidino-2-[5-guanidino-2-(2-{2-[(2-{2-[3-(4-hydroxy-phenyl)-2-methylamino-propionylamino]-acetylamino}-acetyl)-methyl-amino]-3-phenyl-propionylamino}-4-methyl-pentanoylamino)-pentanoylamino]-pentanoylamino}-4-methyl-pentanoic acid amide | CHEMBL428803
TypeSmall organic molecule
Emp. Form.C48H77N15O9
Mol. Mass.1008.2201
SMILESCN[C@@H](Cc1ccc(O)cc1)C(=O)NCC(=O)NCC(=O)N(C)[C@@H](Cc1ccccc1)C(=O)N[C@@H](CC(C)C)C(=O)N[C@@H](CCCNC(N)=N)C(=O)N[C@@H](CCCNC(N)=N)C(=O)N[C@@H](CC(C)C)C(N)=O