Reaction Details
TargetKappa-type opioid receptor
LigandBDBM50010545
Substrate/Competitorn/a
Meas. Tech.ChEBML_145534
Ki 3.9±n/a nM
Citation Yoshino, HNakazawa, TArakawa, YKaneko, TTsuchiya, YMatsunaga, MAraki, SIkeda, MYamatsu, KTachibana, S Synthesis and structure-activity relationships of dynorphin A-(1-8) amide analogues. J Med Chem33:206-12 (1990) Kappa-type opioid receptor
Name:Kappa-type opioid receptor
Type:Enzyme
Mol. Mass.:42656.78
Organism:Mus musculus (Mouse)
Description:P33534
Residue:380
BDBM50010545
NameBDBM50010545
Synonyms:2-{5-Guanidino-2-[(5-guanidino-2-{2-[2-(2-{2-[3-(4-hydroxy-phenyl)-2-methylamino-propionylamino]-acetylamino}-acetylamino)-3-(4-nitro-phenyl)-propionylamino]-4-methyl-pentanoylamino}-pentanoyl)-methyl-amino]-pentanoylamino}-4-methyl-pentanoic acidN-ethyl amide | CHEMBL415410
TypeSmall organic molecule
Emp. Form.C50H80N16O11
Mol. Mass.1081.2708
SMILESCCNC(=O)C(CC(C)C)NC(=O)C(CCC[N-]C(N)=[NH2+])N(C)C(=O)C(CCC[N-]C(N)=[NH2+])NC(=O)C(CC(C)C)NC(=O)C(Cc1ccc(cc1)[N+]([O-])=O)NC(=O)CNC(=O)CNC(=O)C(Cc1ccc(O)cc1)NC