Reaction Details
TargetDelta-type opioid receptor
LigandBDBM50010540
Substrate/Competitorn/a
Meas. Tech.ChEBML_145634
IC50 4.6±n/a nM
Citation Yoshino, HNakazawa, TArakawa, YKaneko, TTsuchiya, YMatsunaga, MAraki, SIkeda, MYamatsu, KTachibana, S Synthesis and structure-activity relationships of dynorphin A-(1-8) amide analogues. J Med Chem33:206-12 (1990) Delta-type opioid receptor
Name:Delta-type opioid receptor
Type:Enzyme Catalytic Domain
Mol. Mass.:40577.25
Organism:MOUSE
Description:P32300
Residue:372
BDBM50010540
NameBDBM50010540
Synonyms:2-[2-(2-{2-[3-(4-Hydroxy-phenyl)-2-methylamino-propionylamino]-acetylamino}-acetylamino)-3-phenyl-propionylamino]-4-methyl-pentanoic acid {1-[1-(1-ethylcarbamoyl-3-methyl-butylcarbamoyl)-4-guanidino-butylcarbamoyl]-4-guanidino-butyl}-amide | CHEMBL268105
TypeSmall organic molecule
Emp. Form.C49H79N15O9
Mol. Mass.1022.2467
SMILESCCNC(=O)[C@H](CC(C)C)NC(=O)[C@H](CCCNC(N)=N)NC(=O)[C@H](CCCNC(N)=N)NC(=O)[C@H](CC(C)C)NC(=O)[C@@H](Cc1ccccc1)NC(=O)CNC(=O)CNC(=O)[C@H](Cc1ccc(O)cc1)NC