Reaction Details
TargetArachidonate 5-lipoxygenase-activating protein
LigandBDBM50078033
Substrate/Competitorn/a
Meas. Tech.ChEBML_1696510
IC50 2.4±n/a nM
Citation Bartolozzi, AAbeywardane, ABosanac, TBroadwater, JAChen, ZHutzler, JMHuber, JDNemoto, POlague, ARiether, DSimpson, TTakahashi, HWu, LZhang, YZindell, RM Discovery and optimization of oxadiazole-based FLAP inhibitors. Bioorg Med Chem Lett27:4652-4659 (2017) 
 
Arachidonate 5-lipoxygenase-activating protein
Name:Arachidonate 5-lipoxygenase-activating protein
Type:Enzyme
Mol. Mass.:18159.90
Organism:Homo sapiens (Human)
Description:P20292
Residue:161
BDBM50078033
NameBDBM50078033
Synonyms:CHEMBL3417431
TypeSmall organic molecule
Emp. Form.C22H23N7O2
Mol. Mass.417.4637
SMILESCOCCn1cc(cn1)-c1nc(no1)C1(CCC1)c1ccc(cc1)-c1cnc(N)nc1