Reaction Details
TargetKappa-type opioid receptor
LigandBDBM50010705
Substrate/Competitorn/a
Meas. Tech.ChEBML_145800
IC50 0.285000±n/a nM
Citation Kawasaki, AMKnapp, RJKramer, THWire, WSVasquez, OSYamamura, HIBurks, TFHruby, VJ Design and synthesis of highly potent and selective cyclic dynorphin A analogues. J Med Chem33:1874-9 (1990) Kappa-type opioid receptor
Name:Kappa-type opioid receptor
Type:G Protein-Coupled Receptor (GPCR)
Mol. Mass.:42744.99
Organism:Cavia porcellus (domestic guinea pig)
Description:P41144
Residue:380
BDBM50010705
NameBDBM50010705
Synonyms:CHEMBL385759 | H-Tyr-Gly-Gly-Phe-Cys-Arg-Arg-Ile-Arg-Pro-Cys-NH2
TypeSmall organic molecule
Emp. Form.C57H89N21O12S2
Mol. Mass.1324.58
SMILESCC[C@H](C)[C@@H]1NC(=O)[C@H](CCCNC(N)=N)NC(=O)[C@H](CCCNC(N)=N)NC(=O)[C@H](CSSC[C@H](NC(=O)[C@@H]2CCCN2C(=O)[C@H](CCCNC(N)=N)NC1=O)C(N)=O)NC(=O)[C@H](Cc1ccccc1)NC(=O)CNC(=O)CNC(=O)[C@@H](N)Cc1ccc(O)cc1