Reaction Details
TargetKappa-type opioid receptor
LigandBDBM50010701
Substrate/Competitorn/a
Meas. Tech.ChEBML_145800
IC50 0.110000±n/a nM
Citation Kawasaki, AMKnapp, RJKramer, THWire, WSVasquez, OSYamamura, HIBurks, TFHruby, VJ Design and synthesis of highly potent and selective cyclic dynorphin A analogues. J Med Chem33:1874-9 (1990) Kappa-type opioid receptor
Name:Kappa-type opioid receptor
Type:G Protein-Coupled Receptor (GPCR)
Mol. Mass.:42744.99
Organism:Cavia porcellus (domestic guinea pig)
Description:P41144
Residue:380
BDBM50010701
NameBDBM50010701
Synonyms:CHEMBL410616 | H-Tyr-Gly-Gly-Phe-Leu-Arg-Arg-D-Cys-Arg-Pro-Lys-Leu-D-Cys-NH2
TypeSmall organic molecule
Emp. Form.C69H112N24O14S2
Mol. Mass.1565.91
SMILESCC(C)C[C@H](NC(=O)[C@H](Cc1ccccc1)NC(=O)CNC(=O)CNC(=O)[C@@H](N)Cc1ccc(O)cc1)C(=O)N[C@@H](CCCNC(N)=N)C(=O)N[C@@H](CCCNC(N)=N)C(=O)N[C@@H]1CSSC[C@@H](NC(=O)[C@H](CC(C)C)NC(=O)[C@H](CCCCN)NC(=O)[C@@H]2CCCN2C(=O)[C@H](CCCNC(N)=N)NC1=O)C(N)=O