Reaction Details
TargetMu-type opioid receptor
LigandBDBM50010700
Substrate/Competitorn/a
Meas. Tech.ChEBML_146979
IC50 2.3±n/a nM
Citation Kawasaki, AMKnapp, RJKramer, THWire, WSVasquez, OSYamamura, HIBurks, TFHruby, VJ Design and synthesis of highly potent and selective cyclic dynorphin A analogues. J Med Chem33:1874-9 (1990) Mu-type opioid receptor
Name:Mu-type opioid receptor
Type:Enzyme Catalytic Domain
Mol. Mass.:11165.58
Organism:GUINEA PIG
Description:P97266
Residue:98
BDBM50010700
NameBDBM50010700
Synonyms:CHEMBL265824 | H-Tyr-Gly-Gly-Phe-Cys-Arg-Arg-D-Ala-Arg-Pro-Cys-NH2
TypeSmall organic molecule
Emp. Form.C54H83N21O12S2
Mol. Mass.1282.5
SMILESC[C@H]1NC(=O)[C@H](CCCNC(N)=N)NC(=O)[C@H](CCCNC(N)=N)NC(=O)[C@H](CSSC[C@H](NC(=O)[C@@H]2CCCN2C(=O)[C@H](CCCNC(N)=N)NC1=O)C(N)=O)NC(=O)[C@H](Cc1ccccc1)NC(=O)CNC(=O)CNC(=O)[C@@H](N)Cc1ccc(O)cc1