Reaction Details
TargetDelta-type opioid receptor
LigandBDBM50010703
Substrate/Competitorn/a
Meas. Tech.ChEBML_146866
IC50 4±n/a nM
Citation Kawasaki, AMKnapp, RJKramer, THWire, WSVasquez, OSYamamura, HIBurks, TFHruby, VJ Design and synthesis of highly potent and selective cyclic dynorphin A analogues. J Med Chem33:1874-9 (1990) Delta-type opioid receptor
Name:Delta-type opioid receptor
Type:G Protein-Coupled Receptor (GPCR)
Mol. Mass.:40382.98
Organism:Homo sapiens (Human)
Description:Competition binding assays were carried out using membrane preparations from transfected HN9.10 cells that constitutively expressed the delta opioid receptor.
Residue:372
BDBM50010703
NameBDBM50010703
Synonyms:CHEMBL443068 | H-Tyr-Gly-Gly-Phe-Leu-Arg-Arg-Cys-Arg-Pro-Lys-Leu-Cys-NH2
TypeSmall organic molecule
Emp. Form.C69H112N24O14S2
Mol. Mass.1565.91
SMILESCC(C)C[C@H](NC(=O)[C@H](Cc1ccccc1)NC(=O)CNC(=O)CNC(=O)[C@@H](N)Cc1ccc(O)cc1)C(=O)N[C@@H](CCCNC(N)=N)C(=O)N[C@@H](CCCNC(N)=N)C(=O)N[C@H]1CSSC[C@H](NC(=O)[C@H](CC(C)C)NC(=O)[C@H](CCCCN)NC(=O)[C@@H]2CCCN2C(=O)[C@H](CCCNC(N)=N)NC1=O)C(N)=O