Reaction Details
TargetDelta-type/Kappa-type/Mu-type opioid receptor
LigandBDBM50010701
Substrate/Competitorn/a
Meas. Tech.ChEMBL_149658 (CHEMBL756021)
IC50 1.8±n/a nM
Citation Kawasaki, AMKnapp, RJKramer, THWire, WSVasquez, OSYamamura, HIBurks, TFHruby, VJ Design and synthesis of highly potent and selective cyclic dynorphin A analogues. J Med Chem33:1874-9 (1990) Delta-type/Kappa-type/Mu-type opioid receptor
Name:Delta-type/Kappa-type/Mu-type opioid receptor
Synonyms:Opioid receptors; mu/kappa/delta
Type:n/a
Mol. Mass.:n/a
Description:ASSAY_ID of ChEMBL is 357797
Components:This complex has 3 components.
Component 1
Name:Mu-type opioid receptor
Type:G Protein-Coupled Receptor (GPCR)
Mol. Mass.:44789.51
Organism:Homo sapiens (Human)
Description:P35372
Residue:400
Component 2
Name:Kappa-type opioid receptor
Synonyms:K-OR-1 Kappa-opioid receptor (KOR) Kappa-type opioid receptor (KOR) OPIATE Kappa OPRK1 kappa opioid receptor (KOR)
Type:G Protein-Coupled Receptor (GPCR)
Mol. Mass.:42648.76
Organism:Homo sapiens (Human)
Description:P41145
Residue:380
Component 3
Name:Delta-type opioid receptor
Synonyms:D-OR-1 Delta opioid receptor OPIATE Delta OPRD1 OPRK1 | opioid receptor, delta 1
Type:G Protein-Coupled Receptor (GPCR)
Mol. Mass.:40382.98
Organism:Homo sapiens (Human)
Description:Competition binding assays were carried out using membrane preparations from transfected HN9.10 cells that constitutively expressed the delta opioid receptor.
Residue:372
BDBM50010701
NameBDBM50010701
Synonyms:CHEMBL410616 | H-Tyr-Gly-Gly-Phe-Leu-Arg-Arg-D-Cys-Arg-Pro-Lys-Leu-D-Cys-NH2
TypeSmall organic molecule
Emp. Form.C69H112N24O14S2
Mol. Mass.1565.91
SMILESCC(C)C[C@H](NC(=O)[C@H](Cc1ccccc1)NC(=O)CNC(=O)CNC(=O)[C@@H](N)Cc1ccc(O)cc1)C(=O)N[C@@H](CCCNC(N)=N)C(=O)N[C@@H](CCCNC(N)=N)C(=O)N[C@@H]1CSSC[C@@H](NC(=O)[C@H](CC(C)C)NC(=O)[C@H](CCCCN)NC(=O)[C@@H]2CCCN2C(=O)[C@H](CCCNC(N)=N)NC1=O)C(N)=O