Reaction Details
TargetBromodomain-containing protein 4
LigandBDBM50365463
Substrate/Competitorn/a
Meas. Tech.ChEBML_1696637
IC50 61±n/a nM
Citation Ali, ILee, JGo, AChoi, GLee, K Discovery of novel [1,2,4]triazolo[4,3-a]quinoxaline aminophenyl derivatives as BET inhibitors for cancer treatment. Bioorg Med Chem Lett27:4606-4613 (2017) 
 
Bromodomain-containing protein 4
Name:Bromodomain-containing protein 4
Type:Protein
Mol. Mass.:152264.84
Organism:Homo sapiens (Human)
Description:O60885
Residue:1362
BDBM50365463
NameBDBM50365463
Synonyms:CHEMBL1232461
TypeSmall organic molecule
Emp. Form.C22H22ClN5O2
Mol. Mass.423.895
SMILESCCNC(=O)C[C@@H]1N=C(c2ccc(Cl)cc2)c2cc(OC)ccc2-n2c(C)nnc12