Reaction Details
TargetPotassium voltage-gated channel subfamily H member 2
LigandBDBM50262528
Substrate/Competitorn/a
Meas. Tech.ChEMBL_1696845 (CHEMBL4047735)
IC50 18±n/a nM
Citation Procopiou, PAFord, AJGore, PMHancock, APHodgson, STHolmes, DSLooker, BEVile, SClark, KLSaunders, KASlack, RJWatts, CJ Identification of selective 8-(piperidin-4-yloxy)quinoline sulfone and sulfonamide histamine H Bioorg Med Chem Lett27:4914-4919 (2017) 
 
Potassium voltage-gated channel subfamily H member 2
Name:Potassium voltage-gated channel subfamily H member 2
Type:Multi-pass membrane protein
Mol. Mass.:126672.65
Organism:Homo sapiens (Human)
Description:Q12809
Residue:1159
BDBM50262528
NameBDBM50262528
Synonyms:CHEMBL4088039
TypeSmall organic molecule
Emp. Form.C28H45Cl2N3O3S
Mol. Mass.574.646
SMILESCl.Cl.CCCCc1cc(OC2CCN(CCCCNS(=O)(=O)C3CCCCC3)CC2)c2ncccc2c1