Reaction Details
TargetCyclin-A2/Cyclin-dependent kinase 2
LigandBDBM50263045
Substrate/Competitorn/a
Meas. Tech.ChEMBL_1697421 (CHEMBL4048311)
IC50 1410±n/a nM
Citation Bharate, SBKumar, VJain, SKMintoo, MJGuru, SKNuthakki, VKSharma, MBharate, SSGandhi, SGMondhe, DMBhushan, SVishwakarma, RA Discovery and Preclinical Development of IIIM-290, an Orally Active Potent Cyclin-Dependent Kinase Inhibitor. J Med Chem61:1664-1687 (2018) 
 
Cyclin-A2/Cyclin-dependent kinase 2
Name:Cyclin-A2/Cyclin-dependent kinase 2
Type:Protein Complex
Mol. Mass.:n/a
Description:Cdk2/Cyclin A kinase was purified from insect cells coinfected with Cyclin A/Cdk2 baculovirus.
Components:This complex has 2 components.
Component 1
Name:Cyclin-dependent kinase 2
Synonyms:CDK2 CDK2_HUMAN Cell division protein kinase 2 Protein cereblon/Cyclin-dependent kinase 2 | p33 protein kinase
Type:Enzyme Subunit
Mol. Mass.:33938.17
Organism:Homo sapiens (Human)
Description:P24941
Residue:298
Component 2
Name:Cyclin-A2
Synonyms:CCN1 CCNA1 CCNA2_HUMAN Cyclin-A
Type:Enzyme Subunit
Mol. Mass.:48550.19
Organism:Homo sapiens (Human)
Description:P20248
Residue:432
BDBM50263045
NameBDBM50263045
Synonyms:CHEMBL4074270
TypeSmall organic molecule
Emp. Form.C23H22ClNO5
Mol. Mass.427.877
SMILESCN1CC[C@@H]([C@H](O)C1)c1c(O)cc(O)c2c1oc(\C=C\c1ccccc1Cl)cc2=O