Reaction Details
TargetDihydrofolate reductase
LigandBDBM50010929
Substrate/Competitorn/a
Meas. Tech.ChEBML_54215
IC50 8.8±n/a nM
Citation Abraham, AMcGuire, JJGalivan, JNimec, ZKisliuk, RLGaumont, YNair, MG Folate analogues. 34. Synthesis and antitumor activity of non-polyglutamylatable inhibitors of dihydrofolate reductase. J Med Chem34:222-7 (1991) Dihydrofolate reductase
Name:Dihydrofolate reductase
Type:Enzyme
Mol. Mass.:21453.99
Organism:Homo sapiens (Human)
Description:Recombinant human DHFR.
Residue:187
BDBM50010929
NameBDBM50010929
Synonyms:2-{4-[2-(2,4-Diamino-pteridin-6-yl)-ethyl]-benzoylamino}-4-methylene-pentanedioic acid | CHEMBL307486
TypeSmall organic molecule
Emp. Form.C21H21N7O5
Mol. Mass.451.4353
SMILESNc1nc(N)c2nc(CCc3ccc(cc3)C(=O)NC(CC(=C)C(O)=O)C(O)=O)cnc2n1