Reaction Details
TargetDihydrofolate reductase
LigandBDBM50010932
Substrate/Competitorn/a
Meas. Tech.ChEBML_54215
IC50 4.1±n/a nM
Citation Abraham, AMcGuire, JJGalivan, JNimec, ZKisliuk, RLGaumont, YNair, MG Folate analogues. 34. Synthesis and antitumor activity of non-polyglutamylatable inhibitors of dihydrofolate reductase. J Med Chem34:222-7 (1991) Dihydrofolate reductase
Name:Dihydrofolate reductase
Type:Enzyme
Mol. Mass.:21453.99
Organism:Homo sapiens (Human)
Description:Recombinant human DHFR.
Residue:187
BDBM50010932
NameBDBM50010932
Synonyms:(10-DA, 10-Deazaminopterin)2-{4-[2-(2,4-Diamino-pteridin-6-yl)-ethyl]-benzoylamino}-pentanedioic acid 2-{4-[2-(2,4-Diamino-pteridin-6-yl)-ethyl]-benzoylamino}-pentanedioic acid(10-DAM) | CHEMBL11191
TypeSmall organic molecule
Emp. Form.C20H21N7O5
Mol. Mass.439.4246
SMILESNc1nc(N)c2nc(CCc3ccc(cc3)C(=O)NC(CCC(O)=O)C(O)=O)cnc2n1