Reaction Details
TargetHistone deacetylase 6
LigandBDBM50263466
Substrate/Competitorn/a
Meas. Tech.ChEBML_1697937
Ki 1.8±n/a nM
Citation Sellmer, AStangl, HBeyer, MGrünstein, ELeonhardt, MPongratz, HEichhorn, EElz, SStriegl, BJenei-Lanzl, ZDove, SStraub, RHKrämer, OHMahboobi, S Marbostat-100 Defines a New Class of Potent and Selective Antiinflammatory and Antirheumatic Histone Deacetylase 6 Inhibitors. J Med Chem61:3454-3477 (2018) 
 
Histone deacetylase 6
Name:Histone deacetylase 6
Type:Chromatin regulator; hydrolase; repressor
Mol. Mass.:131381.51
Organism:Homo sapiens (Human)
Description:Q9UBN7
Residue:1215
BDBM50263466
NameBDBM50263466
Synonyms:CHEMBL4100615
TypeSmall organic molecule
Emp. Form.C26H22N4O4
Mol. Mass.454.4773
SMILESCN1C(=O)C2CN(Cc3c2c2ccc4ccccc4c2n3Cc2ccc(cc2)C(=O)NO)C1=O