Reaction Details
TargetHistone deacetylase 6
LigandBDBM50263449
Substrate/Competitorn/a
Meas. Tech.ChEBML_1697937
Ki 0.160000±n/a nM
Citation Sellmer, AStangl, HBeyer, MGrünstein, ELeonhardt, MPongratz, HEichhorn, EElz, SStriegl, BJenei-Lanzl, ZDove, SStraub, RHKrämer, OHMahboobi, S Marbostat-100 Defines a New Class of Potent and Selective Antiinflammatory and Antirheumatic Histone Deacetylase 6 Inhibitors. J Med Chem61:3454-3477 (2018) 
 
Histone deacetylase 6
Name:Histone deacetylase 6
Type:Chromatin regulator; hydrolase; repressor
Mol. Mass.:131381.51
Organism:Homo sapiens (Human)
Description:Q9UBN7
Residue:1215
BDBM50263449
NameBDBM50263449
Synonyms:CHEMBL4101480
TypeSmall organic molecule
Emp. Form.C23H24N4O4
Mol. Mass.420.4611
SMILESCOc1ccc2n(Cc3ccc(cc3)C(=O)NO)c3CN4CC(c3c2c1)C(=O)N(C)C4