Reaction Details
TargetCysteine protease
LigandBDBM210854
Substrate/Competitorn/a
Meas. Tech.ChEBML_1698165
Ki 2.5±n/a nM
Citation Giroud, MDietzel, UAnselm, LBanner, DKuglstatter, ABenz, JBlanc, JBGaufreteau, DLiu, HLin, XStich, AKuhn, BSchuler, FKaiser, MBrun, RSchirmeister, TKisker, CDiederich, FHaap, W Repurposing a Library of Human Cathepsin L Ligands: Identification of Macrocyclic Lactams as Potent Rhodesain and Trypanosoma brucei Inhibitors. J Med Chem61:3350-3369 (2018) 
 
Cysteine protease
Name:Cysteine protease
Synonyms:Rhodesain
Type:PROTEIN
Mol. Mass.:48425.78
Organism:Trypanosoma brucei rhodesiense
Description:ChEMBL_619861
Residue:450
BDBM210854
NameBDBM210854
TypeSmall organic molecule
Emp. Form.C24H22IN3O4
Mol. Mass.543.3537
SMILESIc1cc2C[C@H](NC(=O)c3ccccc3OC\C=C\COc1cc2)C(=O)NC1(CC1)C#N