Reaction Details
TargetProcathepsin L
LigandBDBM50263577
Substrate/Competitorn/a
Meas. Tech.ChEBML_1698166
Ki 2.3±n/a nM
Citation Giroud, MDietzel, UAnselm, LBanner, DKuglstatter, ABenz, JBlanc, JBGaufreteau, DLiu, HLin, XStich, AKuhn, BSchuler, FKaiser, MBrun, RSchirmeister, TKisker, CDiederich, FHaap, W Repurposing a Library of Human Cathepsin L Ligands: Identification of Macrocyclic Lactams as Potent Rhodesain and Trypanosoma brucei Inhibitors. J Med Chem61:3350-3369 (2018) 
 
Procathepsin L
Name:Procathepsin L
Type:Enzyme
Mol. Mass.:37557.19
Organism:Homo sapiens (Human)
Description:Purchased from Calbiochem (San Diego, CA).
Residue:333
BDBM50263577
NameBDBM50263577
Synonyms:CHEMBL4099651
TypeSmall organic molecule
Emp. Form.C26H30ClN5O3
Mol. Mass.496.001
SMILESCC(C)(C)c1cc2nn1CC\C=C\COc1ccc(C[C@H](NC2=O)C(=O)NC2(CC2)C#N)cc1Cl