Reaction Details
TargetCysteine protease
LigandBDBM210853
Substrate/Competitorn/a
Meas. Tech.ChEBML_1698165
Ki 11±n/a nM
Citation Giroud, MDietzel, UAnselm, LBanner, DKuglstatter, ABenz, JBlanc, JBGaufreteau, DLiu, HLin, XStich, AKuhn, BSchuler, FKaiser, MBrun, RSchirmeister, TKisker, CDiederich, FHaap, W Repurposing a Library of Human Cathepsin L Ligands: Identification of Macrocyclic Lactams as Potent Rhodesain and Trypanosoma brucei Inhibitors. J Med Chem61:3350-3369 (2018) 
 
Cysteine protease
Name:Cysteine protease
Synonyms:Rhodesain
Type:PROTEIN
Mol. Mass.:48425.78
Organism:Trypanosoma brucei rhodesiense
Description:ChEMBL_619861
Residue:450
BDBM210853
NameBDBM210853
Synonyms:US9290467, 23
TypeSmall organic molecule
Emp. Form.C25H23ClF3N3O4
Mol. Mass.521.916
SMILESFC(F)(F)c1ccc2c(OCCCCOc3ccc(C[C@H](NC2=O)C(=O)NC2(CC2)C#N)cc3Cl)c1