Reaction Details
TargetAtypical chemokine receptor 3
LigandBDBM50263853
Substrate/Competitorn/a
Meas. Tech.ChEMBL_1698353 (CHEMBL4049243)
IC50 2000±n/a nM
Citation Sekiguchi, HKuroyanagi, TRhainds, DKobayashi, KKobayashi, YOhno, HHeveker, NAkaji, KFujii, NOishi, S Structure-Activity Relationship Study of Cyclic Pentapeptide Ligands for Atypical Chemokine Receptor 3 (ACKR3). J Med Chem61:3745-3751 (2018) 
 
Atypical chemokine receptor 3
Name:Atypical chemokine receptor 3
Type:Enzyme
Mol. Mass.:41498.84
Organism:Homo sapiens (Human)
Description:P25106
Residue:362
BDBM50263853
NameBDBM50263853
Synonyms:CHEMBL4063675
TypeSmall organic molecule
Emp. Form.C40H52N8O6
Mol. Mass.740.8909
SMILES[H][C@@]12CCCN1C(=O)[C@H](Cc1ccc3ccccc3c1)NC(=O)[C@H](CCCNC(N)=N)N(C)C(=O)[C@@]([H])(NC(=O)[C@@H](Cc1ccc(O)cc1)NC2=O)[C@@H](C)CC