Reaction Details
TargetAtypical chemokine receptor 3
LigandBDBM50264056
Substrate/Competitorn/a
Meas. Tech.ChEMBL_1698353 (CHEMBL4049243)
IC50 1500±n/a nM
Citation Sekiguchi, HKuroyanagi, TRhainds, DKobayashi, KKobayashi, YOhno, HHeveker, NAkaji, KFujii, NOishi, S Structure-Activity Relationship Study of Cyclic Pentapeptide Ligands for Atypical Chemokine Receptor 3 (ACKR3). J Med Chem61:3745-3751 (2018) 
 
Atypical chemokine receptor 3
Name:Atypical chemokine receptor 3
Type:Enzyme
Mol. Mass.:41498.84
Organism:Homo sapiens (Human)
Description:P25106
Residue:362
BDBM50264056
NameBDBM50264056
Synonyms:CHEMBL4098734
TypeSmall organic molecule
Emp. Form.C39H51N11O6
Mol. Mass.769.8923
SMILES[H][C@@]12CCCN1C(=O)[C@H](Cc1ccc3ccccc3c1)NC(=O)[C@H](CCNC(N)=N)N(C)C(=O)[C@H](CCCNC(N)=N)NC(=O)[C@@H](Cc1ccc(O)cc1)NC2=O