Reaction Details
TargetAngiotensin-converting enzyme
LigandBDBM50011191
Substrate/Competitorn/a
Meas. Tech.ChEBML_35216
IC50 0.700000±n/a nM
Citation Bennion, CBrown, RCCook, ARManners, CNPayling, DWRobinson, DH Design, synthesis, and physicochemical properties of a novel, conformationally restricted 2,3-dihydro-1,3,4-thiadiazole-containing angiotensin converting enzyme inhibitor which is preferentially eliminated by the biliary route in rats. J Med Chem34:439-47 (1991) Angiotensin-converting enzyme
Name:Angiotensin-converting enzyme
Type:PROTEIN
Mol. Mass.:150907.81
Organism:Rattus norvegicus
Description:ChEMBL_35219
Residue:1313
BDBM50011191
NameBDBM50011191
Synonyms:3-[6-Amino-2-(1-carboxy-3-phenyl-propylamino)-hexanoyl]-5-tert-butyl-2,3-dihydro-[1,3,4]thiadiazole-2-carboxylic acid | CHEMBL139140
TypeSmall organic molecule
Emp. Form.C23H34N4O5S
Mol. Mass.478.605
SMILESCC(C)(C)C1=NN([C@@H](S1)C(O)=O)C(=O)[C@H](CCCCN)N[C@@H](CCc1ccccc1)C(O)=O