Reaction Details
TargetAngiotensin-converting enzyme
LigandBDBM50011192
Substrate/Competitorn/a
Meas. Tech.ChEBML_35216
IC50 0.950000±n/a nM
Citation Bennion, CBrown, RCCook, ARManners, CNPayling, DWRobinson, DH Design, synthesis, and physicochemical properties of a novel, conformationally restricted 2,3-dihydro-1,3,4-thiadiazole-containing angiotensin converting enzyme inhibitor which is preferentially eliminated by the biliary route in rats. J Med Chem34:439-47 (1991) Angiotensin-converting enzyme
Name:Angiotensin-converting enzyme
Type:PROTEIN
Mol. Mass.:150907.81
Organism:Rattus norvegicus
Description:ChEMBL_35219
Residue:1313
BDBM50011192
NameBDBM50011192
Synonyms:(R)-1-[(S)-2-((S)-1-Carboxy-3-phenyl-propylamino)-propionyl]-pyrrolidine-2-carboxylic acid 1-((2S)-2-{[(1S)-1-CARBOXY-3-PHENYLPROPYL]AMINO}PROPANOYL)-L-PROLINE 1-[2-(1-Carboxy-3-phenyl-propylamino)-propionyl]-pyrrolidine-2-carboxylic acid 1-[2-(1-Carboxy-3-phenyl-propylamino)-propionyl]-pyrrolidine-2-carboxylic acid(Enalaprilat) CHEMBL577 Lexxel Vaseretic | Vasotec
TypeSmall organic molecule
Emp. Form.C18H24N2O5
Mol. Mass.348.3936
SMILESCC(NC(CCc1ccccc1)C(O)=O)C(=O)N1CCC[C@H]1C(O)=O