Reaction Details
TargetPotassium voltage-gated channel subfamily H member 2
LigandBDBM50264278
Substrate/Competitorn/a
Meas. Tech.ChEMBL_1698459 (CHEMBL4049349)
Ki<13±n/a nM
Citation Menhaji-Klotz, EHesp, KDLondregan, ATKalgutkar, ASPiotrowski, DWBoehm, MSong, KRyder, TBeaumont, KJones, RMAtkinson, KBrown, JALitchfield, JXiao, JCanterbury, DPBurford, KThuma, BALimberakis, CJiao, WBagley, SWAgarwal, SCrowell, DPazdziorko, SWard, JPrice, DAClerin, V Discovery of a Novel Small-Molecule Modulator of C-X-C Chemokine Receptor Type 7 as a Treatment for Cardiac Fibrosis. J Med Chem61:3685-3696 (2018) 
 
Potassium voltage-gated channel subfamily H member 2
Name:Potassium voltage-gated channel subfamily H member 2
Type:Multi-pass membrane protein
Mol. Mass.:126672.65
Organism:Homo sapiens (Human)
Description:Q12809
Residue:1159
BDBM50264278
NameBDBM50264278
Synonyms:CHEMBL4064803
TypeSmall organic molecule
Emp. Form.C25H26N4OS
Mol. Mass.430.565
SMILESCOc1ccc2cccnc2c1N1CCCN(Cc2csc(n2)-c2ccccc2)CC1