Reaction Details
TargetSerine/threonine-protein kinase A-Raf
LigandBDBM50264690
Substrate/Competitorn/a
Meas. Tech.ChEMBL_1699091 (CHEMBL4050073)
IC50 43±n/a nM
Citation Wang, LZhang, QZhu, GZhang, ZZhi, YZhang, LMao, TZhou, XChen, YLu, TTang, W Design, synthesis and evaluation of derivatives based on pyrimidine scaffold as potent Pan-Raf inhibitors to overcome resistance. Eur J Med Chem130:86-106 (2017) 
 
Serine/threonine-protein kinase A-Raf
Name:Serine/threonine-protein kinase A-Raf
Type:Enzyme
Mol. Mass.:67610.81
Organism:Homo sapiens (Human)
Description:P10398
Residue:606
BDBM50264690
NameBDBM50264690
Synonyms:CHEMBL4066939
TypeSmall organic molecule
Emp. Form.C30H33F3N6O3
Mol. Mass.582.6166
SMILESCNc1cc(ncn1)C1(CC1)C(=O)Nc1cc(ccc1C)C(=O)Nc1ccc(OC2CCN(C)CC2)c(c1)C(F)(F)F