Reaction Details
TargetTransient receptor potential cation channel subfamily V member 4
LigandBDBM50264845
Substrate/Competitorn/a
Meas. Tech.ChEMBL_1699599 (CHEMBL4050581)
IC50 0.500000±n/a nM
Citation Tsuno, NYukimasa, AYoshida, OSuzuki, SNakai, HOgawa, TFujiu, MTakaya, KNozu, AYamaguchi, HMatsuda, HFunaki, SYamanada, NTanimura, MNagamatsu, DAsaki, THorita, NYamamoto, MHinata, MSoga, MImai, MMorioka, YKanemasa, TSakaguchi, GIso, Y Pharmacological evaluation of novel (6-aminopyridin-3-yl)(4-(pyridin-2-yl)piperazin-1-yl) methanone derivatives as TRPV4 antagonists for the treatment of pain. Bioorg Med Chem25:2177-2190 (2017) 
 
Transient receptor potential cation channel subfamily V member 4
Name:Transient receptor potential cation channel subfamily V member 4
Type:Enzyme
Mol. Mass.:98290.10
Organism:Homo sapiens (Human)
Description:Q9HBA0
Residue:871
BDBM50264845
NameBDBM50264845
Synonyms:CHEMBL4095552
TypeSmall organic molecule
Emp. Form.C24H24N8OS2
Mol. Mass.504.63
SMILESCc1nc(C)c(s1)-c1csc(Nc2ccc(cn2)C(=O)N2C3CCC2CN(C3)c2ncccn2)n1