Reaction Details
TargetTransient receptor potential cation channel subfamily V member 4
LigandBDBM50264855
Substrate/Competitorn/a
Meas. Tech.ChEMBL_1699599 (CHEMBL4050581)
IC50 0.990000±n/a nM
Citation Tsuno, NYukimasa, AYoshida, OSuzuki, SNakai, HOgawa, TFujiu, MTakaya, KNozu, AYamaguchi, HMatsuda, HFunaki, SYamanada, NTanimura, MNagamatsu, DAsaki, THorita, NYamamoto, MHinata, MSoga, MImai, MMorioka, YKanemasa, TSakaguchi, GIso, Y Pharmacological evaluation of novel (6-aminopyridin-3-yl)(4-(pyridin-2-yl)piperazin-1-yl) methanone derivatives as TRPV4 antagonists for the treatment of pain. Bioorg Med Chem25:2177-2190 (2017) 
 
Transient receptor potential cation channel subfamily V member 4
Name:Transient receptor potential cation channel subfamily V member 4
Type:Enzyme
Mol. Mass.:98290.10
Organism:Homo sapiens (Human)
Description:Q9HBA0
Residue:871
BDBM50264855
NameBDBM50264855
Synonyms:CHEMBL4091558
TypeSmall organic molecule
Emp. Form.C24H23F3N8OS2
Mol. Mass.560.618
SMILESC[C@@H]1CN(CCN1c1ncc(cn1)C(F)(F)F)C(=O)c1ccc(Nc2nc(cs2)-c2sc(C)nc2C)nc1