Reaction Details
TargetProprotein convertase subtilisin/kexin type 6
LigandBDBM50265091
Substrate/Competitorn/a
Meas. Tech.ChEBML_1699614
Ki 1.000000±n/a nM
Citation Ma?uch, ILevesque, CKwiatkowska, ACouture, FLy, KDesjardins, RNeugebauer, WAPrahl, ADay, R Positional Scanning Identifies the Molecular Determinants of a High Affinity Multi-Leucine Inhibitor for Furin and PACE4. J Med Chem60:2732-2744 (2017) 
 
Proprotein convertase subtilisin/kexin type 6
Name:Proprotein convertase subtilisin/kexin type 6
Type:PROTEIN
Mol. Mass.:106442.22
Organism:Homo sapiens (Human)
Description:ChEMBL_1290742
Residue:969
BDBM50265091
NameBDBM50265091
Synonyms:CHEMBL4083310
TypeSmall organic molecule
Emp. Form.C50H86N14O8
Mol. Mass.1011.3068
SMILESCC(C)C[C@H](NC(=O)[C@H](CC(C)C)NC(=O)[C@@H]1CCCN1C(=O)[C@H](CC(C)C)NC(C)=O)C(=O)N[C@@H](CCCNC(N)=N)C(=O)N[C@@H](C(C)C)C(=O)N[C@@H](CCCCN)C(=O)NCc1ccc(cc1)C(N)=N