Reaction Details
TargetProprotein convertase subtilisin/kexin type 6
LigandBDBM50265131
Substrate/Competitorn/a
Meas. Tech.ChEBML_1699614
Ki 2.0±n/a nM
Citation Ma?uch, ILevesque, CKwiatkowska, ACouture, FLy, KDesjardins, RNeugebauer, WAPrahl, ADay, R Positional Scanning Identifies the Molecular Determinants of a High Affinity Multi-Leucine Inhibitor for Furin and PACE4. J Med Chem60:2732-2744 (2017) 
 
Proprotein convertase subtilisin/kexin type 6
Name:Proprotein convertase subtilisin/kexin type 6
Type:PROTEIN
Mol. Mass.:106442.22
Organism:Homo sapiens (Human)
Description:ChEMBL_1290742
Residue:969
BDBM50265131
NameBDBM50265131
Synonyms:CHEMBL4093570
TypeSmall organic molecule
Emp. Form.C50H88N14O8
Mol. Mass.1013.3227
SMILESCC(C)C[C@H](NC(C)=O)C(=O)N[C@@H](C(C)C)C(=O)N[C@@H](CC(C)C)C(=O)N[C@@H](CC(C)C)C(=O)N[C@@H](CCCNC(N)=N)C(=O)N[C@@H](C(C)C)C(=O)N[C@@H](CCCCN)C(=O)NCc1ccc(cc1)C(N)=N