Reaction Details
TargetBromodomain-containing protein 4
LigandBDBM50265653
Substrate/Competitorn/a
Meas. Tech.ChEMBL_1700128 (CHEMBL4051110)
Ki 2.8±n/a nM
Citation Wang, LPratt, JKSoltwedel, TSheppard, GSFidanze, SDLiu, DHasvold, LAMantei, RAHolms, JHMcClellan, WJWendt, MDWada, CFrey, RHansen, TMHubbard, RPark, CHLi, LMagoc, TJAlbert, DHLin, XWarder, SEKovar, PHuang, XWilcox, DWang, RRajaraman, GPetros, AMHutchins, CWPanchal, SCSun, CElmore, SWShen, YKati, WMMcDaniel, KF Fragment-Based, Structure-Enabled Discovery of Novel Pyridones and Pyridone Macrocycles as Potent Bromodomain and Extra-Terminal Domain (BET) Family Bromodomain Inhibitors. J Med Chem60:3828-3850 (2017) 
 
Bromodomain-containing protein 4
Name:Bromodomain-containing protein 4
Type:Protein
Mol. Mass.:152264.84
Organism:Homo sapiens (Human)
Description:O60885
Residue:1362
BDBM50265653
NameBDBM50265653
Synonyms:CHEMBL4094644
TypeSmall organic molecule
Emp. Form.C25H27ClN2O5S
Mol. Mass.503.01
SMILESCCS(=O)(=O)Nc1ccc2Oc3ccc(Cl)cc3CCCCCOc3cc(=O)n(C)cc3-c2c1