Reaction Details
TargetBromodomain-containing protein 4
LigandBDBM50265623
Substrate/Competitorn/a
Meas. Tech.ChEMBL_1700128 (CHEMBL4051110)
Ki 2.6±n/a nM
Citation Wang, LPratt, JKSoltwedel, TSheppard, GSFidanze, SDLiu, DHasvold, LAMantei, RAHolms, JHMcClellan, WJWendt, MDWada, CFrey, RHansen, TMHubbard, RPark, CHLi, LMagoc, TJAlbert, DHLin, XWarder, SEKovar, PHuang, XWilcox, DWang, RRajaraman, GPetros, AMHutchins, CWPanchal, SCSun, CElmore, SWShen, YKati, WMMcDaniel, KF Fragment-Based, Structure-Enabled Discovery of Novel Pyridones and Pyridone Macrocycles as Potent Bromodomain and Extra-Terminal Domain (BET) Family Bromodomain Inhibitors. J Med Chem60:3828-3850 (2017) 
 
Bromodomain-containing protein 4
Name:Bromodomain-containing protein 4
Type:Protein
Mol. Mass.:152264.84
Organism:Homo sapiens (Human)
Description:O60885
Residue:1362
BDBM50265623
NameBDBM50265623
Synonyms:CHEMBL4091597
TypeSmall organic molecule
Emp. Form.C22H23ClN2O5S
Mol. Mass.462.946
SMILESCCOc1cc(=O)n(C)cc1-c1cc(NS(=O)(=O)CC)ccc1Oc1ccc(Cl)cc1