Reaction Details
TargetBromodomain-containing protein 4
LigandBDBM50260099
Substrate/Competitorn/a
Meas. Tech.ChEMBL_1700128 (CHEMBL4051110)
Ki 2.0±n/a nM
Citation Wang, LPratt, JKSoltwedel, TSheppard, GSFidanze, SDLiu, DHasvold, LAMantei, RAHolms, JHMcClellan, WJWendt, MDWada, CFrey, RHansen, TMHubbard, RPark, CHLi, LMagoc, TJAlbert, DHLin, XWarder, SEKovar, PHuang, XWilcox, DWang, RRajaraman, GPetros, AMHutchins, CWPanchal, SCSun, CElmore, SWShen, YKati, WMMcDaniel, KF Fragment-Based, Structure-Enabled Discovery of Novel Pyridones and Pyridone Macrocycles as Potent Bromodomain and Extra-Terminal Domain (BET) Family Bromodomain Inhibitors. J Med Chem60:3828-3850 (2017) 
 
Bromodomain-containing protein 4
Name:Bromodomain-containing protein 4
Type:Protein
Mol. Mass.:152264.84
Organism:Homo sapiens (Human)
Description:O60885
Residue:1362
BDBM50260099
NameBDBM50260099
Synonyms:CHEMBL4075567
TypeSmall organic molecule
Emp. Form.C24H24ClNO5S
Mol. Mass.473.969
SMILESCCS(=O)(=O)c1ccc2Oc3ccc(Cl)cc3CCCCOc3cc(=O)n(C)cc3-c2c1