Reaction Details
TargetGlucocorticoid receptor
LigandBDBM50265674
Substrate/Competitorn/a
Meas. Tech.ChEMBL_1700170 (CHEMBL4051152)
Ki 12±n/a nM
Citation Hunt, HJBelanoff, JKWalters, IGourdet, BThomas, JBarton, NUnitt, JPhillips, TSwift, DEaton, E Identification of the Clinical Candidate (R)-(1-(4-Fluorophenyl)-6-((1-methyl-1H-pyrazol-4-yl)sulfonyl)-4,4a,5,6,7,8-hexahydro-1H-pyrazolo[3,4-g]isoquinolin-4a-yl)(4-(trifluoromethyl)pyridin-2-yl)methanone (CORT125134): A Selective Glucocorticoid Receptor (GR) Antagonist. J Med Chem60:3405-3421 (2017) 
 
Glucocorticoid receptor
Name:Glucocorticoid receptor
Type:Enzyme
Mol. Mass.:85656.87
Organism:Homo sapiens (Human)
Description:P04150
Residue:777
BDBM50265674
NameBDBM50265674
Synonyms:CHEMBL3734774
TypeSmall organic molecule
Emp. Form.C29H22F4N4O3S
Mol. Mass.582.569
SMILESFc1ccc(cc1)-n1ncc2C[C@@]3(CN(CCC3=Cc12)S(=O)(=O)c1ccc(cc1)C(F)(F)F)C(=O)c1ccccn1