Reaction Details
TargetMuscarinic acetylcholine receptor M4
LigandBDBM50265995
Substrate/Competitorn/a
Meas. Tech.ChEMBL_1700404 (CHEMBL4051386)
Ki 0.467735±n/a nM
Citation Pegoli, AShe, XWifling, DHübner, HBernhardt, GGmeiner, PKeller, M Radiolabeled Dibenzodiazepinone-Type Antagonists Give Evidence of Dualsteric Binding at the M J Med Chem60:3314-3334 (2017) 
 
Muscarinic acetylcholine receptor M4
Name:Muscarinic acetylcholine receptor M4
Type:Enzyme Catalytic Domain
Mol. Mass.:53079.31
Organism:Homo sapiens (Human)
Description:Cholinergic, muscarinic M4 CHRM4 HUMAN M3::P08173
Residue:479
BDBM50265995
NameBDBM50265995
Synonyms:CHEMBL4097258
TypeSmall organic molecule
Emp. Form.C84H95F12N15O17
Mol. Mass.1814.7242
SMILESOC(=O)C(F)(F)F.OC(=O)C(F)(F)F.OC(=O)C(F)(F)F.OC(=O)C(F)(F)F.CCC(=O)NCc1cc(cc(c1)C(=O)NCCNC(=O)CCc1cn(CCCCC2CCN(CC(=O)N3c4ccccc4NC(=O)c4ccccc34)CC2)cn1)C(=O)NCCNC(=O)CCc1cn(CCCCC2CCN(CC(=O)N3c4ccccc4NC(=O)c4ccccc34)CC2)cn1