Reaction Details
TargetKynurenine 3-monooxygenase
LigandBDBM50266015
Substrate/Competitorn/a
Meas. Tech.ChEBML_1700450
IC50 5010±n/a nM
Citation Walker, ALAncellin, NBeaufils, BBergeal, MBinnie, MBouillot, AClapham, DDenis, AHaslam, CPHolmes, DSHutchinson, JPLiddle, JMcBride, AMirguet, OMowat, CGRowland, PTiberghien, NTrottet, LUings, IWebster, SPZheng, XMole, DJ Development of a Series of Kynurenine 3-Monooxygenase Inhibitors Leading to a Clinical Candidate for the Treatment of Acute Pancreatitis. J Med Chem60:3383-3404 (2017) 
 
Kynurenine 3-monooxygenase
Name:Kynurenine 3-monooxygenase
Type:PROTEIN
Mol. Mass.:55831.03
Organism:Homo sapiens (Human)
Description:ChEMBL_1487479
Residue:486
BDBM50266015
NameBDBM50266015
Synonyms:CHEMBL4076924
TypeSmall organic molecule
Emp. Form.C20H24ClN3O8
Mol. Mass.469.873
SMILESNC(CO)(CO)CO.OC(=O)CCn1c2cc(Cl)c(OCc3ccccn3)cc2oc1=O