Reaction Details
TargetKynurenine 3-monooxygenase
LigandBDBM50131810
Substrate/Competitorn/a
Meas. Tech.ChEMBL_1700449 (CHEMBL4051431)
IC50 1.3±n/a nM
Citation Walker, ALAncellin, NBeaufils, BBergeal, MBinnie, MBouillot, AClapham, DDenis, AHaslam, CPHolmes, DSHutchinson, JPLiddle, JMcBride, AMirguet, OMowat, CGRowland, PTiberghien, NTrottet, LUings, IWebster, SPZheng, XMole, DJ Development of a Series of Kynurenine 3-Monooxygenase Inhibitors Leading to a Clinical Candidate for the Treatment of Acute Pancreatitis. J Med Chem60:3383-3404 (2017) 
 
Kynurenine 3-monooxygenase
Name:Kynurenine 3-monooxygenase
Type:PROTEIN
Mol. Mass.:55831.03
Organism:Homo sapiens (Human)
Description:ChEMBL_1487479
Residue:486
BDBM50131810
NameBDBM50131810
Synonyms:CHEMBL3634602
TypeSmall organic molecule
Emp. Form.C16H14ClN3O5
Mol. Mass.363.752
SMILESC[C@@H](Oc1cc2oc(=O)n(CCC(O)=O)c2cc1Cl)c1cccnn1