Reaction Details
TargetKynurenine 3-monooxygenase
LigandBDBM50266097
Substrate/Competitorn/a
Meas. Tech.ChEMBL_1700450 (CHEMBL4051432)
IC50 1.6±n/a nM
Citation Walker, ALAncellin, NBeaufils, BBergeal, MBinnie, MBouillot, AClapham, DDenis, AHaslam, CPHolmes, DSHutchinson, JPLiddle, JMcBride, AMirguet, OMowat, CGRowland, PTiberghien, NTrottet, LUings, IWebster, SPZheng, XMole, DJ Development of a Series of Kynurenine 3-Monooxygenase Inhibitors Leading to a Clinical Candidate for the Treatment of Acute Pancreatitis. J Med Chem60:3383-3404 (2017) 
 
Kynurenine 3-monooxygenase
Name:Kynurenine 3-monooxygenase
Type:PROTEIN
Mol. Mass.:55831.03
Organism:Homo sapiens (Human)
Description:ChEMBL_1487479
Residue:486
BDBM50266097
NameBDBM50266097
Synonyms:CHEMBL4062730
TypeSmall organic molecule
Emp. Form.C22H28ClN3O7
Mol. Mass.481.927
SMILESNC(CO)(CO)CO.C[C@@H](Oc1cc2onc(CCC(O)=O)c2cc1Cl)c1ccc(C)cn1