Reaction Details
Target15-hydroxyprostaglandin dehydrogenase [NAD(+)]
LigandBDBM50266122
Substrate/Competitorn/a
Meas. Tech.ChEMBL_1700506 (CHEMBL4051488)
Ki 0.060000±n/a nM
Citation Antczak, MIZhang, YWang, CDoran, JNaidoo, JVoruganti, SWilliams, NSMarkowitz, SDReady, JM Inhibitors of 15-Prostaglandin Dehydrogenase To Potentiate Tissue Repair. J Med Chem60:3979-4001 (2017) 
 
15-hydroxyprostaglandin dehydrogenase [NAD(+)]
Name:15-hydroxyprostaglandin dehydrogenase [NAD(+)]
Type:Enzyme
Mol. Mass.:28974.46
Organism:Homo sapiens (Human)
Description:P15428
Residue:266
BDBM50266122
NameBDBM50266122
Synonyms:CHEMBL4070789
TypeSmall organic molecule
Emp. Form.C19H21N5OS3
Mol. Mass.431.598
SMILESCCCC[S@@+]([O-])c1sc2nc(cc(-c3cnc(C)n3C)c2c1N)-c1nccs1