Reaction Details
TargetSerine/threonine-protein kinase pim-1
LigandBDBM50131266
Substrate/Competitorn/a
Meas. Tech.ChEMBL_1701137 (CHEMBL4052119)
Ki 0.060000±n/a nM
Citation Wang, XKolesnikov, ATay, SChan, GChao, QDo, SDrummond, JEbens, AJLiu, NLy, JHarstad, EHu, HMoffat, JMunugalavadla, VMurray, JSlaga, DTsui, VVolgraf, MWallweber, HChang, JH Discovery of 5-Azaindazole (GNE-955) as a Potent Pan-Pim Inhibitor with Optimized Bioavailability. J Med Chem60:4458-4473 (2017) 
 
Serine/threonine-protein kinase pim-1
Name:Serine/threonine-protein kinase pim-1
Type:Protein
Mol. Mass.:35681.82
Organism:Homo sapiens (Human)
Description:P11309
Residue:313
BDBM50131266
NameBDBM50131266
Synonyms:CHEMBL3634758 | US9260425, 173
TypeSmall organic molecule
Emp. Form.C20H22N8
Mol. Mass.374.4423
SMILESCn1cc(cn1)-c1cc2c(n[nH]c2cn1)-c1cccc(n1)N1CCC[C@H](N)C1