Reaction Details
TargetB-cell lymphoma 6 protein
LigandBDBM50266780
Substrate/Competitorn/a
Meas. Tech.ChEMBL_1701343 (CHEMBL4052325)
IC50 480±n/a nM
Citation Kamada, YSakai, NSogabe, SIda, KOki, HSakamoto, KLane, WSnell, GIida, MImaeda, YSakamoto, JMatsui, J Discovery of a B-Cell Lymphoma 6 Protein-Protein Interaction Inhibitor by a Biophysics-Driven Fragment-Based Approach. J Med Chem60:4358-4368 (2017) 
 
B-cell lymphoma 6 protein
Name:B-cell lymphoma 6 protein
Type:PROTEIN
Mol. Mass.:78866.89
Organism:Homo sapiens
Description:ChEMBL_117695
Residue:706
BDBM50266780
NameBDBM50266780
Synonyms:CHEMBL4077392
TypeSmall organic molecule
Emp. Form.C18H15ClN6O
Mol. Mass.366.804
SMILESClc1cnc(NCc2cccnc2)nc1Nc1ccc2NC(=O)Cc2c1