Reaction Details
TargetLysyl oxidase homolog 2
LigandBDBM50266826
Substrate/Competitorn/a
Meas. Tech.ChEMBL_1701350 (CHEMBL4052332)
IC50 140±n/a nM
Citation Rowbottom, MWBain, GCalderon, ILasof, TLonergan, DLai, AHuang, FDarlington, JProdanovich, PSantini, AMKing, CDGoulet, LShannon, KEMa, GLNguyen, KMacKenna, DAEvans, JFHutchinson, JH Identification of 4-(Aminomethyl)-6-(trifluoromethyl)-2-(phenoxy)pyridine Derivatives as Potent, Selective, and Orally Efficacious Inhibitors of the Copper-Dependent Amine Oxidase, Lysyl Oxidase-Like 2 (LOXL2). J Med Chem60:4403-4423 (2017) 
 
Lysyl oxidase homolog 2
Name:Lysyl oxidase homolog 2
Type:PROTEIN
Mol. Mass.:86721.38
Organism:Homo sapiens (Human)
Description:ChEMBL_115990
Residue:774
BDBM50266826
NameBDBM50266826
Synonyms:CHEMBL4105137
TypeSmall organic molecule
Emp. Form.C15H15ClF3N3O3
Mol. Mass.377.746
SMILESCl.CONC(=O)c1cccc(Oc2cc(CN)cc(n2)C(F)(F)F)c1