Reaction Details
TargetProtein Mdm4
LigandBDBM50266878
Substrate/Competitorn/a
Meas. Tech.ChEMBL_1701466 (CHEMBL4052448)
Ki 3150±n/a nM
Citation Twarda-Clapa, AKrzanik, SKubica, KGuzik, KLabuzek, BNeochoritis, CGKhoury, KKowalska, KCzub, MDubin, GDömling, ASkalniak, LHolak, TA 1,4,5-Trisubstituted Imidazole-Based p53-MDM2/MDMX Antagonists with Aliphatic Linkers for Conjugation with Biological Carriers. J Med Chem60:4234-4244 (2017) 
 
Protein Mdm4
Name:Protein Mdm4
Type:Oncoprotein
Mol. Mass.:54842.04
Organism:Homo sapiens (Human)
Description:The HDMX(1-188) were expressed in Escherichia coli BL21 (DE3) as a GST fusion and purified on glutathione sepharose.
Residue:490
BDBM50266878
NameBDBM50266878
Synonyms:CHEMBL4078749
TypeSmall organic molecule
Emp. Form.C25H16Cl2FN3O2
Mol. Mass.480.318
SMILESOC(=O)c1[nH]c2cc(Cl)ccc2c1-c1c(ncn1Cc1ccc(Cl)cc1)-c1ccc(F)cc1