Reaction Details
TargetPlatelet-activating factor receptor
LigandBDBM50011607
Substrate/Competitorn/a
Meas. Tech.ChEBML_56498
IC50 7±n/a nM
Citation Walser, AFlynn, TMason, CCrowley, HMaresca, CYaremko, BO'Donnell, M Triazolobenzo- and triazolothienodiazepines as potent antagonists of platelet activating factor. J Med Chem34:1209-21 (1991) Platelet-activating factor receptor
Name:Platelet-activating factor receptor
Type:Enzyme Catalytic Domain
Mol. Mass.:39219.60
Organism:Homo sapiens (Human)
Description:PAF Platelet activating factor PTAFR HUMAN::P25105
Residue:342
BDBM50011607
NameBDBM50011607
Synonyms:1-{3-[4-(2-Chloro-phenyl)-9-methyl-6H-1-thia-5,7,8,9a-tetraaza-cyclopenta[e]azulen-2-yl]-prop-2-ynyl}-1H-indole-2,3-dione | CHEMBL20003
TypeSmall organic molecule
Emp. Form.C26H16ClN5O2S
Mol. Mass.497.956
SMILESCc1nnc2CN=C(c3cc(sc3-n12)C#CCN1C(=O)C(=O)c2ccccc12)c1ccccc1Cl